BDBM50337775 5-((3-((R)-3-amino-4-(2,4,5-trifluorophenyl)butanoyl)thiazolidine-2-carboxamido)methyl)benzo[d][1,3]dioxole-2-carboxylic acid hydrochloride::CHEMBL1683494
SMILES N[C@@H](CC(=O)N1CCSC1C(=O)NCc1ccc2OC(Oc2c1)C(O)=O)Cc1cc(F)c(F)cc1F
InChI Key InChIKey=QBWONUGOJGPKIR-VYTXHYLQSA-N
Data  1 IC50
  Tab Delimited (TSV)   2D SDfile   Computed 3D by Vconf -m prep SDfile
Find this compound or compounds like it in BindingDB:
Activity Spreadsheet -- Enzyme Inhibition Constant Data from BindingDB
Found 1 hit for monomerid = 50337775
TargetDipeptidyl peptidase 4(Homo sapiens (Human))
Korea Research Institute Of Chemical Technology
Curated by ChEMBL
LigandPNGBDBM50337775(5-((3-((R)-3-amino-4-(2,4,5-trifluorophenyl)butano...)
Affinity DataIC50:  64nM. Assay description: Inhibition of human recombinant DPP4 after 60 mins by fluorescence plate reader
In DepthDetails ArticlePubMed