BDBM50338178 (S)-3-(4-(dimethylcarbamoyloxy)phenyl)-2-(5-(3-nitrophenyl)pyrimidin-4-ylamino)propanoic acid::CHEMBL1684965
SMILES CN(C)C(=O)Oc1ccc(C[C@H](Nc2ncncc2-c2cccc(c2)[N+]([O-])=O)C(O)=O)cc1
InChI Key InChIKey=YFVWNOBDOYWXQX-IBGZPJMESA-N
Data  1 IC50
  Tab Delimited (TSV)   2D SDfile   Computed 3D by Vconf -m prep SDfile
Find this compound or compounds like it in BindingDB:
Activity Spreadsheet -- Enzyme Inhibition Constant Data from BindingDB
Found 1 hit for monomerid = 50338178
TargetIntegrin alpha-4/beta-1(Homo sapiens (Human))
Elan Pharmaceuticals
Curated by ChEMBL
LigandPNGBDBM50338178((S)-3-(4-(dimethylcarbamoyloxy)phenyl)-2-(5-(3-nit...)
Affinity DataIC50:  180nM. Assay description: Inhibition of integrin alpha4beta1-mediated Jurkat cell adhesion to VCAM-1 by FACS analysis
In DepthDetails ArticlePubMed