BDBM50338266 CHEMBL1682020::N-(4-chloro-3-(1H-1,2,4-triazol-5-yl)thiophen-2-yl)-2-(quinolin-5-yl)acetamide
SMILES Clc1csc(NC(=O)Cc2cccc3ncccc23)c1-c1nnc[nH]1
InChI Key InChIKey=BUCXDWXDBZUFMV-UHFFFAOYSA-N
Data  5 IC50
  Tab Delimited (TSV)   2D SDfile   Computed 3D by Vconf -m prep SDfile
Find this compound or compounds like it in BindingDB:
Activity Spreadsheet -- Enzyme Inhibition Constant Data from BindingDB
Found 5 hits for monomerid = 50338266
TargetMitogen-activated protein kinase 10(Homo sapiens (Human))
Elan Pharmaceuticals
Curated by ChEMBL
LigandPNGBDBM50338266(CHEMBL1682020 | N-(4-chloro-3-(1H-1,2,4-triazol-5-...)
Affinity DataIC50:  18nM. Assay description: Inhibition of recombinant JNK3 after 60 mins by TR-FRET assay
In DepthDetails ArticlePubMed
TargetMitogen-activated protein kinase 9(Homo sapiens (Human))
Elan Pharmaceuticals
Curated by ChEMBL
LigandPNGBDBM50338266(CHEMBL1682020 | N-(4-chloro-3-(1H-1,2,4-triazol-5-...)
Affinity DataIC50:  42nM. Assay description: Inhibition of recombinant JNK2 after 60 mins by TR-FRET assay
In DepthDetails ArticlePubMed
TargetMitogen-activated protein kinase 1(Homo sapiens (Human))
Elan Pharmaceuticals
Curated by ChEMBL
LigandPNGBDBM50338266(CHEMBL1682020 | N-(4-chloro-3-(1H-1,2,4-triazol-5-...)
Affinity DataIC50: >5.00E+4nM. Assay description: Inhibition of recombinant ERK2 after 60 mins by TR-FRET assay
In DepthDetails ArticlePubMed
TargetMitogen-activated protein kinase 14(Homo sapiens (Human))
Elan Pharmaceuticals
Curated by ChEMBL
LigandPNGBDBM50338266(CHEMBL1682020 | N-(4-chloro-3-(1H-1,2,4-triazol-5-...)
Affinity DataIC50: >5.00E+4nM. Assay description: Inhibition of recombinant p38alpha after 60 mins by TR-FRET assay
In DepthDetails ArticlePubMed
TargetMitogen-activated protein kinase 8(Homo sapiens (Human))
Elan Pharmaceuticals
Curated by ChEMBL
LigandPNGBDBM50338266(CHEMBL1682020 | N-(4-chloro-3-(1H-1,2,4-triazol-5-...)
Affinity DataIC50:  15nM. Assay description: Inhibition of recombinant JNK1 after 60 mins by TR-FRET assay
In DepthDetails ArticlePubMed