BDBM50338297 1-(4-fluorophenyl)-5-(4-(methylsulfonyl)phenyl)-1H-tetrazole::CHEMBL1682232
SMILES CS(=O)(=O)c1ccc(cc1)-c1nnnn1-c1ccc(F)cc1
InChI Key InChIKey=CMDVIXPVUCWVBP-UHFFFAOYSA-N
Data  2 IC50
  Tab Delimited (TSV)   2D SDfile   Computed 3D by Vconf -m prep SDfile
Find this compound or compounds like it in BindingDB:
Activity Spreadsheet -- Enzyme Inhibition Constant Data from BindingDB
Found 2 hits for monomerid = 50338297
TargetProstaglandin G/H synthase 2(Homo sapiens (Human))
University Of Alberta
Curated by ChEMBL
LigandPNGBDBM50338297(1-(4-fluorophenyl)-5-(4-(methylsulfonyl)phenyl)-1H...)
Affinity DataIC50:  2.70E+3nM. Assay description: Inhibition of human recombinant COX-2 by fluorescence assay
In DepthDetails ArticlePubMed
TargetProstaglandin G/H synthase 1(Ovis aries (Sheep))
University Of Alberta
Curated by ChEMBL
LigandPNGBDBM50338297(1-(4-fluorophenyl)-5-(4-(methylsulfonyl)phenyl)-1H...)
Affinity DataIC50:  6.40E+5nM. Assay description: Inhibition of ovine COX-1 by fluorescence assay
In DepthDetails ArticlePubMed