BDBM50338381 3-(methylsulfinyl)-N-((S)-1-phenylpropyl)-2-(pyridin-2-yl)quinoline-4-carboxamide::CHEMBL1682951
SMILES CC[C@H](NC(=O)c1c(c(nc2ccccc12)-c1ccccn1)S(C)=O)c1ccccc1
InChI Key InChIKey=ZEHYDXFZAZLFHK-LRECHQAASA-N
Data  1 EC50
  Tab Delimited (TSV)   2D SDfile   Computed 3D by Vconf -m prep SDfile
Find this compound or compounds like it in BindingDB:
Activity Spreadsheet -- Enzyme Inhibition Constant Data from BindingDB
Found 1 hit for monomerid = 50338381
TargetNeuromedin-K receptor(Homo sapiens (Human))
Astrazeneca Pharmaceuticals
Curated by ChEMBL
LigandPNGBDBM50338381(3-(methylsulfinyl)-N-((S)-1-phenylpropyl)-2-(pyrid...)
Affinity DataEC50:  1.12E+3nM. Assay description: Antagonist activity at human NK3 receptor expressed in CHO cells assessed as inhibition of senktide-induced calcium flux by FLIPR assay
In DepthDetails ArticlePubMed