BDBM50338837 1-(3-(furan-2-yl)-4,5-dihydro-5-(3-nitrophenyl)pyrazol-1-yl)ethanone::CHEMBL1684767
SMILES CC(=O)N1N=C(CC1c1cccc(c1)[N+]([O-])=O)c1ccco1
InChI Key InChIKey=YBUOYIDNSJTKFE-UHFFFAOYSA-N
Data  1 IC50
  Tab Delimited (TSV)   2D SDfile   Computed 3D by Vconf -m prep SDfile
Find this compound or compounds like it in BindingDB:
Activity Spreadsheet -- Enzyme Inhibition Constant Data from BindingDB
Found 1 hit for monomerid = 50338837
TargetXanthine dehydrogenase/oxidase(Bos taurus (Bovine))
Indo-Soviet Friendship College Of Pharmacy
Curated by ChEMBL
LigandPNGBDBM50338837(1-(3-(furan-2-yl)-4,5-dihydro-5-(3-nitrophenyl)pyr...)
Affinity DataIC50:  1.31E+4nM. Assay description: Inhibition of bovine Xanthine oxidase assessed as decrease in uric acid production preincubated at 293 nM of compound for 5 mins by spectrophotometry
In DepthDetails ArticlePubMed