BDBM50338891 CHEMBL1684837::Ethyl 4-{4-[{4-chloro-2-[(2-chlorophenyl)(hydroxy)-methyl]phenyl}(2,2-dimethylpropyl)amino]-4-oxobutanoyl}-piperazine-1-carboxylate
SMILES CCOC(=O)N1CCN(CC1)C(=O)CCC(=O)N(CC(C)(C)C)c1ccc(Cl)cc1C(O)c1ccccc1Cl
InChI Key InChIKey=ZSSVDRPXSIKSEL-UHFFFAOYSA-N
Data  1 IC50
  Tab Delimited (TSV)   2D SDfile   Computed 3D by Vconf -m prep SDfile
Find this compound or compounds like it in BindingDB:
Activity Spreadsheet -- Enzyme Inhibition Constant Data from BindingDB
Found 1 hit for monomerid = 50338891
TargetSqualene synthase(Homo sapiens (Human))
Daiichi Sankyo
Curated by ChEMBL
LigandPNGBDBM50338891(CHEMBL1684837 | Ethyl 4-{4-[{4-chloro-2-[(2-chloro...)
Affinity DataIC50:  2.30nM. Assay description: Inhibition of squalene synthase
In DepthDetails ArticlePubMed