BDBM50339161 (2S,5S,8S,11S,14S,17S,20S,23S,26S)-23-((1H-imidazol-5-yl)methyl)-17-((1H-indol-3-yl)methyl)-26-((S)-2-((2S,3R)-2-((S)-2-acetamido-4-methylpentanamido)-3-hydroxybutanamido)-3-phenylpropanamido)-1-amino-11-(3-amino-3-oxopropyl)-20-(4-hydroxybenzyl)-5-((R)-1-hydroxyethyl)-2-(hydroxymethyl)-8-isobutyl-14-methyl-1,4,7,10,13,16,19,22,25-nonaoxo-3,6,9,12,15,18,21,24-octaazanonacosan-29-oic acid::CHEMBL1689393
SMILES CC(C)C[C@H](NC(C)=O)C(=O)N[C@@H]([C@@H](C)O)C(=O)N[C@@H](Cc1ccccc1)C(=O)N[C@@H](CCC(O)=O)C(=O)N[C@@H](Cc1cnc[nH]1)C(=O)N[C@@H](Cc1ccc(O)cc1)C(=O)N[C@@H](Cc1c[nH]c2ccccc12)C(=O)N[C@@H](C)C(=O)N[C@@H](CCC(N)=O)C(=O)N[C@@H](CC(C)C)C(=O)N[C@@H]([C@@H](C)O)C(=O)N[C@@H](CO)C(N)=O
InChI Key InChIKey=XFJJAXOQAYVJJR-OLECBNHVSA-N
Data  2 IC50
  Tab Delimited (TSV)   2D SDfile   Computed 3D by Vconf -m prep SDfile
Find this compound or compounds like it in BindingDB:
Activity Spreadsheet -- Enzyme Inhibition Constant Data from BindingDB
Found 2 hits for monomerid = 50339161
TargetProtein Mdm4(Homo sapiens (Human))
State University Of New York
Curated by ChEMBL
LigandPNGBDBM50339161((2S,5S,8S,11S,14S,17S,20S,23S,26S)-23-((1H-imidazo...)
Affinity DataIC50:  550nM. Assay description: Inhibition of human GST-tagged MDMX expressed in Escherichia coli harboring integrated p53-Hmd2 protein assessed as blockade of enzyme-p53 interactio...
In DepthDetails ArticlePubMed
TargetE3 ubiquitin-protein ligase Mdm2(Homo sapiens (Human))
State University Of New York
Curated by ChEMBL
LigandPNGBDBM50339161((2S,5S,8S,11S,14S,17S,20S,23S,26S)-23-((1H-imidazo...)
Affinity DataIC50:  44nM. Assay description: Inhibition of human GST-tagged Mdm2 expressed in Escherichia coli harboring integrated p53-Mmd2 protein assessed as blockade of enzyme-p53 interactio...
In DepthDetails ArticlePubMed