BDBM50339197 CHEMBL1689466
SMILES CSCC[C@H](NC(=O)[C@@H](NC(=O)[C@H](CCCCNC(=O)COCC(=O)Nc1ccc(CCC(=O)N2CCC2=O)cc1)NC(=O)[C@@H]1CSSC[C@H](NC(=O)[C@@H](NC(=O)[C@H](CC(O)=O)NC(=O)[C@H](Cc2ccccc2)NC(C)=O)C(C)C)C(=O)N[C@@H](CC(N)=O)C(=O)N[C@@H](Cc2c[nH]c3ccccc23)C(=O)N[C@@H](C(C)C)C(=O)N[C@@H]([C@@H](C)O)C(=O)N[C@@H](CC(C)C)C(=O)N2CCC[C@H]2C(=O)N[C@@H](Cc2cnc[nH]2)C(=O)N1)C(C)C)C(N)=O
InChI Key InChIKey=VKYWZTDFDFCHTC-NKQUKQHVSA-N
Data  1 IC50  1 Kd
  Tab Delimited (TSV)   2D SDfile   Computed 3D by Vconf -m prep SDfile
Find this compound or compounds like it in BindingDB:
Activity Spreadsheet -- Enzyme Inhibition Constant Data from BindingDB
Found 2 hits for monomerid = 50339197
TargetPlacenta growth factor(Mus musculus)
Pfizer
Curated by ChEMBL
LigandPNGBDBM50339197(CHEMBL1689466)
Affinity DataIC50:  54nM. Assay description: Inhibition of mouse PlGF-VEGFR-1 interaction by ELISA
In DepthDetails ArticlePubMed
TargetPlacenta growth factor(Homo sapiens (Human))
Pfizer
Curated by ChEMBL
LigandPNGBDBM50339197(CHEMBL1689466)
Affinity DataKd:  4nM. Assay description: Binding affinity to human PlGF-1
In DepthDetails ArticlePubMed