BDBM50339218 CHEMBL1689444
SMILES CC[C@H](C)[C@H](NC(=O)[C@H](CC(O)=O)NC(=O)[C@H](Cc1ccc(O)cc1)NC(C)=O)C(=O)N[C@H]1CSSC[C@H](NC(=O)[C@H](Cc2cnc[nH]2)NC(=O)[C@@H]2CCCN2C(=O)[C@H](CC(C)C)NC(=O)[C@H](CCCNC(N)=N)NC(=O)[C@@H](NC(=O)[C@H](Cc2ccc(O)cc2)NC(=O)[C@H](Cc2cnc[nH]2)NC1=O)[C@@H](C)CC)C(=O)N[C@@H](Cc1ccccc1)C(=O)N[C@@H](C)C(=O)N[C@@H](C(C)C)C(N)=O
InChI Key InChIKey=VTMGENFTGPAHPN-ZRPOOPBHSA-N
Data  1 IC50
  Tab Delimited (TSV)   2D SDfile   Computed 3D by Vconf -m prep SDfile
Find this compound or compounds like it in BindingDB:
Activity Spreadsheet -- Enzyme Inhibition Constant Data from BindingDB
Found 1 hit for monomerid = 50339218
TargetPlacenta growth factor(Homo sapiens (Human))
Pfizer
Curated by ChEMBL
LigandPNGBDBM50339218(CHEMBL1689444)
Affinity DataIC50:  1.00E+5nM. Assay description: Inhibition of human PlGF-1-VEGFR-1 interaction by ELISA
In DepthDetails ArticlePubMed