BDBM50339357 (+/-)-(S)-3-(4-Chlorophenyl)-2-[1-(4-chlorophenyl)ethyl]-3-(4-hydroxybutoxy)-2,3-dihydroisoindol-1-one::CHEMBL1688262
SMILES C[C@H](N1C(=O)c2ccccc2C1(OCCCCO)c1ccc(Cl)cc1)c1ccc(Cl)cc1
InChI Key InChIKey=FZKHQGZQDYPRLF-MDYZWHIJSA-N
Data  1 IC50
  Tab Delimited (TSV)   2D SDfile   Computed 3D by Vconf -m prep SDfile
Find this compound or compounds like it in BindingDB:
Activity Spreadsheet -- Enzyme Inhibition Constant Data from BindingDB
Found 1 hit for monomerid = 50339357
TargetE3 ubiquitin-protein ligase Mdm2(Homo sapiens (Human))
Newcastle University
Curated by ChEMBL
LigandPNGBDBM50339357((+/-)-(S)-3-(4-Chlorophenyl)-2-[1-(4-chlorophenyl)...)
Affinity DataIC50:  900nM. Assay description: Inhibition of Mdm2 -p53 protein interaction by ELISA
In DepthDetails ArticlePubMed