BDBM50339373 (+/-)-3-(4-Chlorophenyl)-2-(4-fluorobenzyl)-3-(1-hydroxymethylcyclopropylmethoxy)-2,3-dihydroisoindol-1-one::CHEMBL1688278
SMILES OCC1(COC2(N(Cc3ccc(F)cc3)C(=O)c3ccccc23)c2ccc(Cl)cc2)CC1
InChI Key InChIKey=DAJJKECHCLPZCL-UHFFFAOYSA-N
Data  1 IC50
  Tab Delimited (TSV)   2D SDfile   Computed 3D by Vconf -m prep SDfile
Find this compound or compounds like it in BindingDB:
Activity Spreadsheet -- Enzyme Inhibition Constant Data from BindingDB
Found 1 hit for monomerid = 50339373
TargetE3 ubiquitin-protein ligase Mdm2(Homo sapiens (Human))
Newcastle University
Curated by ChEMBL
LigandPNGBDBM50339373((+/-)-3-(4-Chlorophenyl)-2-(4-fluorobenzyl)-3-(1-h...)
Affinity DataIC50:  2.60E+3nM. Assay description: Inhibition of Mdm2 -p53 protein interaction by ELISA
In DepthDetails ArticlePubMed