BDBM50339378 (+/-)-3-(4-Chlorophenyl)-3-(1-hydroxymethylcyclopropylmethoxy)-2-(4-methoxybenzyl)isoindolin-1-one::CHEMBL1688283
SMILES COc1ccc(CN2C(=O)c3ccccc3C2(OCC2(CO)CC2)c2ccc(Cl)cc2)cc1
InChI Key InChIKey=UINYFDYJACQYJK-UHFFFAOYSA-N
Data  1 IC50
  Tab Delimited (TSV)   2D SDfile   Computed 3D by Vconf -m prep SDfile
Find this compound or compounds like it in BindingDB:
Activity Spreadsheet -- Enzyme Inhibition Constant Data from BindingDB
Found 1 hit for monomerid = 50339378
TargetE3 ubiquitin-protein ligase Mdm2(Homo sapiens (Human))
Newcastle University
Curated by ChEMBL
LigandPNGBDBM50339378((+/-)-3-(4-Chlorophenyl)-3-(1-hydroxymethylcyclopr...)
Affinity DataIC50:  2.80E+3nM. Assay description: Inhibition of Mdm2 -p53 protein interaction by ELISA
In DepthDetails ArticlePubMed