BDBM50339399 (-)-S-3-(4-chlorophenyl)-3-((1-(hydroxymethyl)cyclopropyl)methoxy)-2-(4-nitrobenzyl)isoindolin-1-one::CHEMBL1688304
SMILES OCC1(CO[C@@]2(N(Cc3ccc(cc3)[N+]([O-])=O)C(=O)c3ccccc23)c2ccc(Cl)cc2)CC1
InChI Key InChIKey=FWMIQNMFNBHEKJ-SANMLTNESA-N
Data  1 IC50
  Tab Delimited (TSV)   2D SDfile   Computed 3D by Vconf -m prep SDfile
Find this compound or compounds like it in BindingDB:
Activity Spreadsheet -- Enzyme Inhibition Constant Data from BindingDB
Found 1 hit for monomerid = 50339399
TargetE3 ubiquitin-protein ligase Mdm2(Homo sapiens (Human))
Newcastle University
Curated by ChEMBL
LigandPNGBDBM50339399((-)-S-3-(4-chlorophenyl)-3-((1-(hydroxymethyl)cycl...)
Affinity DataIC50:  1.30E+3nM. Assay description: Inhibition of Mdm2 -p53 protein interaction by ELISA
In DepthDetails ArticlePubMed