BDBM50339415 3-(4-Chlorophenyl)-3-hydroxy-2-(4-chlorobenzyl)isoindolin-1-one::CHEMBL1688139
SMILES OC1(N(Cc2ccc(Cl)cc2)C(=O)c2ccccc12)c1ccc(Cl)cc1
InChI Key InChIKey=DGWNHIXOANURKW-UHFFFAOYSA-N
Data  1 IC50
  Tab Delimited (TSV)   2D SDfile   Computed 3D by Vconf -m prep SDfile
Find this compound or compounds like it in BindingDB:
Activity Spreadsheet -- Enzyme Inhibition Constant Data from BindingDB
Found 1 hit for monomerid = 50339415
TargetE3 ubiquitin-protein ligase Mdm2(Homo sapiens (Human))
Newcastle University
Curated by ChEMBL
LigandPNGBDBM50339415(3-(4-Chlorophenyl)-3-hydroxy-2-(4-chlorobenzyl)iso...)
Affinity DataIC50:  4.20E+3nM. Assay description: Inhibition of Mdm2 -p53 protein interaction by ELISA
In DepthDetails ArticlePubMed