BDBM50339553 (2S,5S,8S,11S)-14-(bicyclo[2.2.1]heptan-2-yl)-11-(2-carboxyethyl)-8-((R)-1-hydroxyethyl)-2-isopropyl-5-methyl-4,7,10-trioxo-3,6,9,12-tetraazatetradecan-1-oic acid::CHEMBL1688617
SMILES CC(C)[C@H](NC(=O)[C@H](C)NC(=O)[C@@H](NC(=O)[C@H](CCC(O)=O)NCCC1CC2CCC1C2)[C@@H](C)O)C(O)=O
InChI Key InChIKey=BQLARHIUYSAOHF-QKDVZYMOSA-N
Data  2 KI
  Tab Delimited (TSV)   2D SDfile   Computed 3D by Vconf -m prep SDfile
Find this compound or compounds like it in BindingDB:
Activity Spreadsheet -- Enzyme Inhibition Constant Data from BindingDB
Found 2 hits for monomerid = 50339553
TargetDisks large homolog 4(Homo sapiens (Human))
University Of Copenhagen
Curated by ChEMBL
LigandPNGBDBM50339553((2S,5S,8S,11S)-14-(bicyclo[2.2.1]heptan-2-yl)-11-(...)
Affinity DataKi:  1.50E+3nM. Assay description: Inhibition of PSD-95 PDZ2 domain by competitive fluorescence polarization assay
In DepthDetails ArticlePubMed
TargetDisks large homolog 4(Homo sapiens (Human))
University Of Copenhagen
Curated by ChEMBL
LigandPNGBDBM50339553((2S,5S,8S,11S)-14-(bicyclo[2.2.1]heptan-2-yl)-11-(...)
Affinity DataKi:  1.40E+4nM. Assay description: Inhibition of PSD-95 PDZ3 domain by competitive fluorescence polarization assay
In DepthDetails ArticlePubMed