BDBM50339691 4-(dimethylamino)-N-(4-(4-(2-methoxyphenyl)piperazin-1-yl)butyl)benzamide::CHEMBL1688990
SMILES COc1ccccc1N1CCN(CCCCNC(=O)c2ccc(cc2)N(C)C)CC1
InChI Key InChIKey=LBZHOUJGVUYWGV-UHFFFAOYSA-N
Data  9 KI
  Tab Delimited (TSV)   2D SDfile   Computed 3D by Vconf -m prep SDfile
Find this compound or compounds like it in BindingDB:
Activity Spreadsheet -- Enzyme Inhibition Constant Data from BindingDB
Found 9 hits for monomerid = 50339691
TargetD(3) dopamine receptor(Homo sapiens (Human))
Washington University
Curated by ChEMBL
LigandPNGBDBM50339691(4-(dimethylamino)-N-(4-(4-(2-methoxyphenyl)piperaz...)
Affinity DataKi:  0.800nM. Assay description: Displacement of of [125I]-IABN from human D3 receptor expressed in HEK293 cell membranes after 60 mins by filtration binding assay
In DepthDetails ArticlePubMed
TargetD(3) dopamine receptor(Homo sapiens (Human))
Washington University
Curated by ChEMBL
LigandPNGBDBM50339691(4-(dimethylamino)-N-(4-(4-(2-methoxyphenyl)piperaz...)
Affinity DataKi:  0.800nM. Assay description: Displacement of [125I]-IABN from human D3 receptor transfected in human HEK 293 cells by gamma-counting
In DepthDetails ArticlePubMed
Target5-hydroxytryptamine receptor 1A(Homo sapiens (Human))
Washington University
Curated by ChEMBL
LigandPNGBDBM50339691(4-(dimethylamino)-N-(4-(4-(2-methoxyphenyl)piperaz...)
Affinity DataKi:  7.5nM. Assay description: Displacement of of [3H]8-OH-DPAT from human 5HT1A receptor after 60 mins by filtration binding assay
In DepthDetails ArticlePubMed
TargetD(2) dopamine receptor(Homo sapiens (Human))
Washington University
Curated by ChEMBL
LigandPNGBDBM50339691(4-(dimethylamino)-N-(4-(4-(2-methoxyphenyl)piperaz...)
Affinity DataKi:  34nM. Assay description: Displacement of of [125I]-IABN from human D2 long receptor expressed in HEK293 cell membranes after 60 mins by filtration binding assay
In DepthDetails ArticlePubMed
TargetD(2) dopamine receptor(Homo sapiens (Human))
Washington University
Curated by ChEMBL
LigandPNGBDBM50339691(4-(dimethylamino)-N-(4-(4-(2-methoxyphenyl)piperaz...)
Affinity DataKi:  34.4nM. Assay description: Displacement of [125I]-IABN from human D2 receptor transfected in human HEK 293 cells by gamma-counting
In DepthDetails ArticlePubMed
TargetD(4) dopamine receptor(Homo sapiens (Human))
Washington University
Curated by ChEMBL
LigandPNGBDBM50339691(4-(dimethylamino)-N-(4-(4-(2-methoxyphenyl)piperaz...)
Affinity DataKi:  896nM. Assay description: Displacement of of [125I]-IABN from human D4 receptor expressed in HEK293 cell membranes after 60 mins by filtration binding assay
In DepthDetails ArticlePubMed
TargetD(4) dopamine receptor(Homo sapiens (Human))
Washington University
Curated by ChEMBL
LigandPNGBDBM50339691(4-(dimethylamino)-N-(4-(4-(2-methoxyphenyl)piperaz...)
Affinity DataKi:  896nM. Assay description: Binding affinity to human D4 receptor transfected in human HEK293 cells by gamma-counting
In DepthDetails ArticlePubMed
TargetSigma non-opioid intracellular receptor 1(Cavia porcellus (Guinea pig))
Washington University
Curated by ChEMBL
LigandPNGBDBM50339691(4-(dimethylamino)-N-(4-(4-(2-methoxyphenyl)piperaz...)
Affinity DataKi:  1.26E+3nM. Assay description: Displacement of [3H]-pentazocine from guinea pig sigma1 receptor by liquid scintillation counting
In DepthDetails ArticlePubMed
TargetAP-2 complex subunit sigma(RAT)
Washington University
Curated by ChEMBL
LigandPNGBDBM50339691(4-(dimethylamino)-N-(4-(4-(2-methoxyphenyl)piperaz...)
Affinity DataKi:  1.57E+3nM. Assay description: Displacement of [3H]-DTG from rat sigma2 receptor by liquid scintillation counting
In DepthDetails ArticlePubMed