BDBM50339804 (+/-)-4-(5-(1-Cyclopropylpiperidin-4-yloxy)-1H-benzo[d]imidazol-1-yl)-2-(1-(2-(trifluoromethyl)phenyl)ethoxy)benzamide::CHEMBL1689169
SMILES CC(Oc1cc(ccc1C(N)=O)-n1cnc2cc(OC3CCN(CC3)C3CC3)ccc12)c1ccccc1C(F)(F)F
InChI Key InChIKey=ZUDYNCJHVWNHDF-UHFFFAOYSA-N
Data  1 IC50
  Tab Delimited (TSV)   2D SDfile   Computed 3D by Vconf -m prep SDfile
Find this compound or compounds like it in BindingDB:
Activity Spreadsheet -- Enzyme Inhibition Constant Data from BindingDB
Found 1 hit for monomerid = 50339804
TargetSerine/threonine-protein kinase Nek2(Homo sapiens (Human))
The Institute Of Cancer Research
Curated by ChEMBL
LigandPNGBDBM50339804((+/-)-4-(5-(1-Cyclopropylpiperidin-4-yloxy)-1H-ben...)
Affinity DataIC50:  2.56E+3nM. Assay description: Inhibition of NEK2
In DepthDetails ArticlePubMed