BDBM50339867 CHEMBL1761273::ethyl 4-(1-hydroxy-1,3-dihydrobenzo[c][1,2]oxaborol-6-yloxy)benzoate
SMILES CCOC(=O)c1ccc(Oc2ccc3COB(O)c3c2)cc1
InChI Key InChIKey=JABURMIKTRZXPS-UHFFFAOYSA-N
Data  1 KI
  Tab Delimited (TSV)   2D SDfile   Computed 3D by Vconf -m prep SDfile
Find this compound or compounds like it in BindingDB:
Activity Spreadsheet -- Enzyme Inhibition Constant Data from BindingDB
Found 1 hit for monomerid = 50339867
TargetBeta-lactamase(Enterobacter cloacae)
Anacor Pharmaceuticals
Curated by ChEMBL
LigandPNGBDBM50339867(CHEMBL1761273 | ethyl 4-(1-hydroxy-1,3-dihydrobenz...)
Affinity DataKi:  5.55E+3nM. Assay description: Inhibition of Enterobacter cloacae P99 beta-lactamase AmpC P99 using nitrocefin as substrate after 30 mins by spectrophotometric analysis
In DepthDetails ArticlePubMed