BDBM50340230 4-amino-1-((6-methylpyridin-3-yl)methyl)-6-(1H-pyrazol-1-yl)-1H-imidazo[4,5-c]pyridin-2(3H)-one::CHEMBL1760583
SMILES Cc1ccc(Cn2c3cc(nc(N)c3[nH]c2=O)-n2cccn2)cn1
InChI Key InChIKey=IWIIEGCJOFYIEZ-UHFFFAOYSA-N
Data  1 IC50  1 EC50
  Tab Delimited (TSV)   2D SDfile   Computed 3D by Vconf -m prep SDfile
Find this compound or compounds like it in BindingDB:
Activity Spreadsheet -- Enzyme Inhibition Constant Data from BindingDB
Found 2 hits for monomerid = 50340230
TargetAdenosine receptor A1(Homo sapiens (Human))
Pfizer
Curated by ChEMBL
LigandPNGBDBM50340230(4-amino-1-((6-methylpyridin-3-yl)methyl)-6-(1H-pyr...)
Affinity DataIC50:  2.80E+3nM. Assay description: Inhibition of Adenosine receptor A1
In DepthDetails ArticlePubMed
TargetToll-like receptor 7(Homo sapiens (Human))
Pfizer
Curated by ChEMBL
LigandPNGBDBM50340230(4-amino-1-((6-methylpyridin-3-yl)methyl)-6-(1H-pyr...)
Affinity DataEC50:  633nM. Assay description: Agonist activity at Toll-like receptor 7
In DepthDetails ArticlePubMed