BDBM50340385 3-(4-(2-(ethylsulfonyl)ethyl)bicyclo[2.2.2]octan-1-yl)-4-methyl-5-o-tolyl-4H-1,2,4-triazole::CHEMBL1761329
SMILES CCS(=O)(=O)CCC12CCC(CC1)(CC2)c1nnc(-c2ccccc2C)n1C
InChI Key InChIKey=BRPRVVJRJMNSBE-UHFFFAOYSA-N
Data  4 IC50
  Tab Delimited (TSV)   2D SDfile   Computed 3D by Vconf -m prep SDfile
Find this compound or compounds like it in BindingDB:
Activity Spreadsheet -- Enzyme Inhibition Constant Data from BindingDB
Found 4 hits for monomerid = 50340385
Target11-beta-hydroxysteroid dehydrogenase 1(Homo sapiens (Human))
Merck Research Laboratories
Curated by ChEMBL
LigandPNGBDBM50340385(3-(4-(2-(ethylsulfonyl)ethyl)bicyclo[2.2.2]octan-1...)
Affinity DataIC50:  20nM. Assay description: Inhibition of human 11beta-HSD1 expressed in CHO-K1 cells assessed as conversion of [3H]-cortisone to [3H]-cortisol by scintillation proximity assay
In DepthDetails ArticlePubMed
Target11-beta-hydroxysteroid dehydrogenase type 2(Homo sapiens (Human))
Merck Research Laboratories
Curated by ChEMBL
LigandPNGBDBM50340385(3-(4-(2-(ethylsulfonyl)ethyl)bicyclo[2.2.2]octan-1...)
Affinity DataIC50: >4.00E+3nM. Assay description: Inhibition of human 11beta-HSD2 expressed in CHO-K1 cells assessed as conversion of [3H]-cortisol to [3H]-cortisone by scintillation proximity assay
In DepthDetails ArticlePubMed
Target11-beta-hydroxysteroid dehydrogenase type 2(Mus musculus (mouse))
Merck Research Laboratories
Curated by ChEMBL
LigandPNGBDBM50340385(3-(4-(2-(ethylsulfonyl)ethyl)bicyclo[2.2.2]octan-1...)
Affinity DataIC50: >4.00E+3nM. Assay description: Inhibition of mouse 11beta-HSD2 expressed in CHO-K1 cells assessed as conversion of [3H]-cortisol to [3H]-cortisone by scintillation proximity assay
In DepthDetails ArticlePubMed
Target11-beta-hydroxysteroid dehydrogenase 1(Mus musculus (mouse))
Merck Research Laboratories
Curated by ChEMBL
LigandPNGBDBM50340385(3-(4-(2-(ethylsulfonyl)ethyl)bicyclo[2.2.2]octan-1...)
Affinity DataIC50:  21nM. Assay description: Inhibition of mouse 11beta-HSD1 expressed in CHO-K1 cells assessed as conversion of [3H]-cortisone to [3H]-cortisol by scintillation proximity assay
In DepthDetails ArticlePubMed