BDBM50340475 (1S,3aS,3bS,9aR,9bS,11aS)-N,N-diethyl-5,9a,11a-trimethyl-7-oxo-2,3,3a,3b,4,5,7,8,9,9a,9b,10,11,11a-tetradecahydro-1H-cyclopenta[i]phenanthridine-1-carboxamide::CHEMBL1762032
SMILES CCN(CC)C(=O)[C@H]1CC[C@H]2[C@@H]3CN(C)C4=CC(=O)CC[C@]4(C)[C@H]3CC[C@]12C
InChI Key InChIKey=WGXIPTXZHSOQQB-VPOPLMJOSA-N
Data  2 IC50
  Tab Delimited (TSV)   2D SDfile   Computed 3D by Vconf -m prep SDfile
Find this compound or compounds like it in BindingDB:
Activity Spreadsheet -- Enzyme Inhibition Constant Data from BindingDB
Found 2 hits for monomerid = 50340475
Target3-oxo-5-alpha-steroid 4-dehydrogenase 2(Homo sapiens (Human))TBA
LigandPNGBDBM50340475((1S,3aS,3bS,9aR,9bS,11aS)-N,N-diethyl-5,9a,11a-tri...)
Affinity DataIC50:  2.30nM. Assay description: Inhibition of Homo sapiens (human) Steroid 5-alpha-reductase type 2
In DepthDetails Article
Target3 beta-hydroxysteroid dehydrogenase/Delta 5-->4-isomerase(Mycobacterium tuberculosis)
Stony Brook University
Curated by ChEMBL
LigandPNGBDBM50340475((1S,3aS,3bS,9aR,9bS,11aS)-N,N-diethyl-5,9a,11a-tri...)
Affinity DataIC50: >4.00E+5nM. Assay description: Inhibition of Mycobacterium tuberculosis 3 beta hydroxysteriod dehydrogenase
In DepthDetails ArticlePubMed