BDBM50340745 2-(4-(2-(4-chlorophenethylamino)pyrimidin-4-yl)piperazin-1-yl)-N-((3,5-dichloropyridin-4-yl)methyl)-N-(pyridin-4-ylmethyl)acetamide::CHEMBL1762700
SMILES Clc1ccc(CCNc2nccc(n2)N2CCN(CC(=O)N(Cc3ccncc3)Cc3c(Cl)cncc3Cl)CC2)cc1
InChI Key InChIKey=SIDDLPPKYXYJJX-UHFFFAOYSA-N
Data  1 IC50
  Tab Delimited (TSV)   2D SDfile   Computed 3D by Vconf -m prep SDfile
Find this compound or compounds like it in BindingDB:
Activity Spreadsheet -- Enzyme Inhibition Constant Data from BindingDB
Found 1 hit for monomerid = 50340745
TargetMas-related G-protein coupled receptor member X1(Homo sapiens (Human))
Astrazeneca R&D Montreal
Curated by ChEMBL
LigandPNGBDBM50340745(2-(4-(2-(4-chlorophenethylamino)pyrimidin-4-yl)pip...)
Affinity DataIC50:  24nM. Assay description: Antagonist activity at SNSR4 in human HEK293 cells by FLIPR assay
In DepthDetails ArticlePubMed