BDBM50340764 (S)-2-((R)-2-(4-fluoro-3-methylphenyl)-2-methoxyethyl)-6-(4-fluorobenzylamino)-N-hydroxyhexanamide::CHEMBL1760329
SMILES CO[C@H](C[C@H](CCCCNCc1ccc(F)cc1)C(=O)NO)c1ccc(F)c(C)c1
InChI Key InChIKey=JBIQHCHBSPKGCU-SIKLNZKXSA-N
Data  1 KI
  Tab Delimited (TSV)   2D SDfile   Computed 3D by Vconf -m prep SDfile
Find this compound or compounds like it in BindingDB:
Activity Spreadsheet -- Enzyme Inhibition Constant Data from BindingDB
Found 1 hit for monomerid = 50340764
TargetLethal factor(Bacillus anthracis)
Panthera Biopharma
Curated by ChEMBL
LigandPNGBDBM50340764((S)-2-((R)-2-(4-fluoro-3-methylphenyl)-2-methoxyet...)
Affinity DataKi:  0.930nM. Assay description: Inhibition of Bacillus anthracis lethal factor assessed as proteolysis using MCA-KKVYPYPME-Dap(Dnp)-NH2 peptide substrate after 4 hrs by FRET assay
In DepthDetails ArticlePubMed