BDBM50340868 2-(4-(5-chloro-1H-indole-2-carboxamido)-3-(5-methyl-4,5,6,7-tetrahydrothiazolo[5,4-c]pyridine-2-carboxamido)phenoxy)acetic acid::CHEMBL1761625
SMILES CN1CCc2nc(sc2C1)C(=O)Nc1cc(OCC(O)=O)ccc1NC(=O)c1cc2cc(Cl)ccc2[nH]1
InChI Key InChIKey=OBNVLLFTELTAFO-UHFFFAOYSA-N
Data  1 IC50
  Tab Delimited (TSV)   2D SDfile   Computed 3D by Vconf -m prep SDfile
Find this compound or compounds like it in BindingDB:
Activity Spreadsheet -- Enzyme Inhibition Constant Data from BindingDB
Found 1 hit for monomerid = 50340868
TargetCoagulation factor X(Homo sapiens (Human))
Daiichi Sankyo
Curated by ChEMBL
LigandPNGBDBM50340868(2-(4-(5-chloro-1H-indole-2-carboxamido)-3-(5-methy...)
Affinity DataIC50:  2.5nM. Assay description: Inhibition of human factor 10a using S2222 chromogenic substrate by spectrophotometric analysis
In DepthDetails ArticlePubMed