BDBM50340972 CHEMBL1762255::N-(tert-butylcarbamoyl)-4-((1R,2S,4R)-1,7,7-trimethylbicyclo[2.2.1]heptan-2-ylamino)pyridine-3-sulfonamide
SMILES CC(C)(C)NC(=O)NS(=O)(=O)c1cnccc1N[C@H]1C[C@H]2CC[C@]1(C)C2(C)C
InChI Key InChIKey=SKRHDNAURICTLH-PSGMQZRDSA-N
Data  1 IC50  2 EC50
  Tab Delimited (TSV)   2D SDfile   Computed 3D by Vconf -m prep SDfile
Find this compound or compounds like it in BindingDB:
Activity Spreadsheet -- Enzyme Inhibition Constant Data from BindingDB
Found 3 hits for monomerid = 50340972
TargetBombesin receptor subtype-3(Homo sapiens (Human))
Merck Research Laboratories
Curated by ChEMBL
LigandPNGBDBM50340972(CHEMBL1762255 | N-(tert-butylcarbamoyl)-4-((1R,2S,...)
Affinity DataIC50:  300nM. Assay description: Binding affinity to human BRS3
In DepthDetails ArticlePubMed
TargetBombesin receptor subtype-3(Homo sapiens (Human))
Merck Research Laboratories
Curated by ChEMBL
LigandPNGBDBM50340972(CHEMBL1762255 | N-(tert-butylcarbamoyl)-4-((1R,2S,...)
Affinity DataEC50:  450nM. Assay description: Agonist activity at human BRS3 by functional assay
In DepthDetails ArticlePubMed
TargetBombesin receptor subtype-3(Mus musculus)
Merck Research Laboratories
Curated by ChEMBL
LigandPNGBDBM50340972(CHEMBL1762255 | N-(tert-butylcarbamoyl)-4-((1R,2S,...)
Affinity DataEC50:  33nM. Assay description: Agonist activity at mouse BRS3 by functional assay
In DepthDetails ArticlePubMed