BDBM50341207 (S,S)-2-(3'-Chlorophenyl)-4-ethyl-3,5,5-trimethylmorpholine::CHEMBL1765599
SMILES CCN1[C@@H](C)[C@@](O)(OCC1(C)C)c1cccc(Cl)c1
InChI Key InChIKey=VNRFZHXTMQEXQW-XHDPSFHLSA-N
Data  6 IC50
  Tab Delimited (TSV)   2D SDfile   Computed 3D by Vconf -m prep SDfile
Find this compound or compounds like it in BindingDB:
Activity Spreadsheet -- Enzyme Inhibition Constant Data from BindingDB
Found 6 hits for monomerid = 50341207
TargetSodium-dependent dopamine transporter(Homo sapiens (Human))
Research Triangle Institute
Curated by ChEMBL
LigandPNGBDBM50341207((S,S)-2-(3'-Chlorophenyl)-4-ethyl-3,5,5-trimethylm...)
Affinity DataIC50:  44nM. Assay description: Inhibition of human DAT in HEK293 cells assessed as inhibition of [3H]dopamine uptake
In DepthDetails ArticlePubMed
TargetSodium-dependent noradrenaline transporter(Homo sapiens (Human))
Research Triangle Institute
Curated by ChEMBL
LigandPNGBDBM50341207((S,S)-2-(3'-Chlorophenyl)-4-ethyl-3,5,5-trimethylm...)
Affinity DataIC50:  24nM. Assay description: Inhibition of human NET in HEK293 cells assessed as inhibition of [3H]norepinephrine uptake
In DepthDetails ArticlePubMed
TargetNeuronal acetylcholine receptor subunit alpha-4/beta-4(Homo sapiens (Human))
Research Triangle Institute
Curated by ChEMBL
LigandPNGBDBM50341207((S,S)-2-(3'-Chlorophenyl)-4-ethyl-3,5,5-trimethylm...)
Affinity DataIC50:  6.40E+3nM. Assay description: Antagonist activity at human alpha4beta4 nAChR in HEK293 cells assessed as inhibition of carbamylcholine-induced radiolabeled Rb ion efflux
In DepthDetails ArticlePubMed
TargetNeuronal acetylcholine receptor subunit alpha-3/beta-4(Homo sapiens (Human))
Research Triangle Institute
Curated by ChEMBL
LigandPNGBDBM50341207((S,S)-2-(3'-Chlorophenyl)-4-ethyl-3,5,5-trimethylm...)
Affinity DataIC50:  790nM. Assay description: Antagonist activity at human alpha3beta4 nAChR in HEK293 cells assessed as inhibition of carbamylcholine-induced radiolabeled Rb ion efflux
In DepthDetails ArticlePubMed
TargetNeuronal acetylcholine receptor subunit alpha-4/beta-2(Homo sapiens (Human))
Research Triangle Institute
Curated by ChEMBL
LigandPNGBDBM50341207((S,S)-2-(3'-Chlorophenyl)-4-ethyl-3,5,5-trimethylm...)
Affinity DataIC50:  7.20E+3nM. Assay description: Antagonist activity at human alpha4beta2 nAChR in HEK293 cells assessed as inhibition of carbamylcholine-induced radiolabeled Rb ion efflux
In DepthDetails ArticlePubMed
TargetSodium-dependent serotonin transporter(Homo sapiens (Human))
Research Triangle Institute
Curated by ChEMBL
LigandPNGBDBM50341207((S,S)-2-(3'-Chlorophenyl)-4-ethyl-3,5,5-trimethylm...)
Affinity DataIC50:  1.50E+3nM. Assay description: Inhibition of human SERT in HEK293 cells assessed as inhibition of [3H]serotonin uptake
In DepthDetails ArticlePubMed