BDBM50341224 5-(1-(4-fluoro-3-methylphenyl)-2-oxo-1,2-dihydrobenzo[h][1,6]naphthyridin-9-yl)picolinonitrile::CHEMBL1765613
SMILES Fc1ccc(cc1C(F)(F)F)-n1c2c(ccc1=O)cnc1ccc(cc21)-c1ccc(nc1)C#N
InChI Key InChIKey=PBEHJFYEBNZKRF-UHFFFAOYSA-N
Data  2 EC50
  Tab Delimited (TSV)   2D SDfile   Computed 3D by Vconf -m prep SDfile
Find this compound or compounds like it in BindingDB:
Activity Spreadsheet -- Enzyme Inhibition Constant Data from BindingDB
Found 2 hits for monomerid = 50341224
TargetPhosphatidylinositol 4,5-bisphosphate 3-kinase catalytic subunit alpha isoform(Homo sapiens (Human))
Dana-Farber Cancer Institute
Curated by ChEMBL
LigandPNGBDBM50341224(5-(1-(4-fluoro-3-methylphenyl)-2-oxo-1,2-dihydrobe...)
Affinity DataEC50: >1.25E+3nM. Assay description: Inhibition of PI3Kalpha in human PC3 cells expressing Akt1 S473D mutant assessed as phosphorylation of Akt Thr308 by immunoblotting
In DepthDetails ArticlePubMed
TargetSerine/threonine-protein kinase mTOR(Mus musculus (Mouse))
Dana-Farber Cancer Institute
Curated by ChEMBL
LigandPNGBDBM50341224(5-(1-(4-fluoro-3-methylphenyl)-2-oxo-1,2-dihydrobe...)
Affinity DataEC50:  20nM. Assay description: Inhibition of mTOR in p53-deficient MEF assessed as phosphorylation of S6K1 at Thr389 by immunoblotting
In DepthDetails ArticlePubMed