BDBM50341259 5-(2,5-dimethoxybenzylidene)-2-p-tolylthiazol-4(5H)-one::CHEMBL1765889
SMILES COc1ccc(OC)c(\C=C2/SC(=NC2=O)c2ccc(C)cc2)c1
InChI Key InChIKey=CYVSPICIGBHXOG-BOPFTXTBSA-N
Data  4 IC50
  Tab Delimited (TSV)   2D SDfile   Computed 3D by Vconf -m prep SDfile
Find this compound or compounds like it in BindingDB:
Activity Spreadsheet -- Enzyme Inhibition Constant Data from BindingDB
Found 4 hits for monomerid = 50341259
TargetPolyunsaturated fatty acid 5-lipoxygenase(Homo sapiens (Human))
Goethe-University Frankfurt
Curated by ChEMBL
LigandPNGBDBM50341259(5-(2,5-dimethoxybenzylidene)-2-p-tolylthiazol-4(5H...)
Affinity DataIC50:  350nM. Assay description: Inhibition of 5-lipoxygenase in human polymorphonuclear leukocytes assessed as inhibition of LTB4 production preincubated for 15 mins measured after ...Checked by Author
In DepthDetails ArticlePubMed
TargetPolyunsaturated fatty acid 5-lipoxygenase(Homo sapiens (Human))
Goethe-University Frankfurt
Curated by ChEMBL
LigandPNGBDBM50341259(5-(2,5-dimethoxybenzylidene)-2-p-tolylthiazol-4(5H...)
Affinity DataIC50:  130nM. Assay description: Inhibition of 5-lipoxygenase in S100 supernatant assessed as inhibition of (5(S)-hydroperoxy-6-trans-8,11,14-cis-eicosatetraenoic acid production pre...Checked by Author
In DepthDetails ArticlePubMed
TargetPolyunsaturated fatty acid 5-lipoxygenase(Homo sapiens (Human))
Goethe-University Frankfurt
Curated by ChEMBL
LigandPNGBDBM50341259(5-(2,5-dimethoxybenzylidene)-2-p-tolylthiazol-4(5H...)
Affinity DataIC50:  130nM. Assay description: Inhibition of 5-lipoxygenase in S100 supernatant assessed as inhibition of LTB4 production preincubated for 15 mins measured after 10 mins by HPLC me...Checked by Author
In DepthDetails ArticlePubMed
TargetPolyunsaturated fatty acid 5-lipoxygenase(Homo sapiens (Human))
Goethe-University Frankfurt
Curated by ChEMBL
LigandPNGBDBM50341259(5-(2,5-dimethoxybenzylidene)-2-p-tolylthiazol-4(5H...)
Affinity DataIC50:  350nM. Assay description: Inhibition of 5-lipoxygenase in human polymorphonuclear leukocytes assessed as inhibition of (5(S)-hydroperoxy-6-trans-8,11,14-cis-eicosatetraenoic a...Checked by Author
In DepthDetails ArticlePubMed