BDBM50341407 CHEMBL4167351::US11534443, Example 3
SMILES COc1ncc(cc1NS(=O)(=O)c1ccc(F)cc1)-c1cc(OC2CCOCC2)c2nc(N)nc(C)c2c1
InChI Key InChIKey=CJBQWRITBDWUOS-UHFFFAOYSA-N
Data  2 IC50
  Tab Delimited (TSV)   2D SDfile   Computed 3D by Vconf -m prep SDfile
Find this compound or compounds like it in BindingDB:
Activity Spreadsheet -- Enzyme Inhibition Constant Data from BindingDB
Found 2 hits for monomerid = 50341407
TargetPhosphatidylinositol 4-phosphate 3-kinase C2 domain-containing subunit alpha(Homo sapiens (Human))
Institute Of Materia Medica, Chinese Academy Of Medical Sciences
US Patent
LigandPNGBDBM50341407(CHEMBL4167351 | US11534443, Example 3)
Affinity DataIC50:  1.10nM. Assay description: The Kinase-Glo™ Kinase Assay Kit was purchased from Promega. All assays were performed at room temperature using white OptiPlate™-384 well plate. The...
In DepthDetails US Patent
TargetPhosphatidylinositol 4,5-bisphosphate 3-kinase catalytic subunit alpha isoform(Homo sapiens (Human))
Chinese Academy Of Medical Sciences And Peking Union Medical College
Curated by ChEMBL
LigandPNGBDBM50341407(CHEMBL4167351 | US11534443, Example 3)
Affinity DataIC50:  1.20nM. Assay description: Inhibition of PI3Kalpha (unknown origin) using PIP2 as substrate by Kinase-Glo assay
In DepthDetails ArticlePubMed