BDBM50341535 3-(4-Cyanobenzoylamino)-5-(pyridin-4-yl)-(1H)-pyridin-2-one::CHEMBL1765765
SMILES O=C(Nc1cc(c[nH]c1=O)-c1ccncc1)c1ccc(cc1)C#N
InChI Key InChIKey=XCVORFCACCGIKX-UHFFFAOYSA-N
Data  1 KI
  Tab Delimited (TSV)   2D SDfile   Computed 3D by Vconf -m prep SDfile
Find this compound or compounds like it in BindingDB:
Activity Spreadsheet -- Enzyme Inhibition Constant Data from BindingDB
Found 1 hit for monomerid = 50341535
TargetTyrosine-protein kinase ITK/TSK(Homo sapiens (Human))
Vertex Pharmaceuticals
Curated by ChEMBL
LigandPNGBDBM50341535(3-(4-Cyanobenzoylamino)-5-(pyridin-4-yl)-(1H)-pyri...)
Affinity DataKi: >6.00E+3nM. Assay description: Inhibition of Itk after 40 mins by radiometric phosphate incorporation assay
In DepthDetails ArticlePubMed