BDBM50341640 3-(4-Methylpiperazin-1-yl)-N-(3-nitrobenzyl)quinolin-5-amine::CHEMBL1766513
SMILES CN1CCN(CC1)c1cnc2cccc(NCc3cccc(c3)[N+]([O-])=O)c2c1
InChI Key InChIKey=WWJRLPXUJXVCEF-UHFFFAOYSA-N
Data  1 IC50
  Tab Delimited (TSV)   2D SDfile   Computed 3D by Vconf -m prep SDfile
Find this compound or compounds like it in BindingDB:
Activity Spreadsheet -- Enzyme Inhibition Constant Data from BindingDB
Found 1 hit for monomerid = 50341640
TargetHepatocyte growth factor receptor(Homo sapiens (Human))
Chinese Academy Of Sciences
Curated by ChEMBL
LigandPNGBDBM50341640(3-(4-Methylpiperazin-1-yl)-N-(3-nitrobenzyl)quinol...)
Affinity DataIC50:  166nM. Assay description: Inhibition of purified recombinant c-Met after 60 mins by ELISA
In DepthDetails ArticlePubMed