BDBM50341642 3-(piperidin-1-yl)-N-(3-nitrobenzyl)-7-(trifluoromethyl)quinolin-5-amine::CHEMBL1766538
SMILES [O-][N+](=O)c1cccc(CNc2cc(cc3ncc(cc23)N2CCCCC2)C(F)(F)F)c1
InChI Key InChIKey=HZFDTRRALNDGFT-UHFFFAOYSA-N
Data  1 IC50
  Tab Delimited (TSV)   2D SDfile   Computed 3D by Vconf -m prep SDfile
Find this compound or compounds like it in BindingDB:
Activity Spreadsheet -- Enzyme Inhibition Constant Data from BindingDB
Found 1 hit for monomerid = 50341642
TargetHepatocyte growth factor receptor(Homo sapiens (Human))
Chinese Academy Of Sciences
Curated by ChEMBL
LigandPNGBDBM50341642(3-(piperidin-1-yl)-N-(3-nitrobenzyl)-7-(trifluorom...)
Affinity DataIC50:  3.40nM. Assay description: Inhibition of purified recombinant c-Met after 60 mins by ELISA
In DepthDetails ArticlePubMed