BDBM50341750 3-amino-6-(4-(tert-butylsulfonyl)phenyl)-N-phenylpyrazine-2-carboxamide::CHEMBL1766796
SMILES CC(C)(C)S(=O)(=O)c1ccc(cc1)-c1cnc(N)c(n1)C(=O)Nc1ccccc1
InChI Key InChIKey=POUGLMSADRXIGI-UHFFFAOYSA-N
Data  4 IC50
  Tab Delimited (TSV)   2D SDfile   Computed 3D by Vconf -m prep SDfile
Find this compound or compounds like it in BindingDB:
Activity Spreadsheet -- Enzyme Inhibition Constant Data from BindingDB
Found 4 hits for monomerid = 50341750
TargetSerine/threonine-protein kinase ATR(Homo sapiens (Human))
Vertex Pharmaceuticals
Curated by ChEMBL
LigandPNGBDBM50341750(3-amino-6-(4-(tert-butylsulfonyl)phenyl)-N-phenylp...)
Affinity DataIC50:  1.00E+3nM. Assay description: Inhibition of ATR in human HT-29 cells assessed as hydroxyurea-induced phosphorylation of H2AX by immunofluorescence microscopy
In DepthDetails ArticlePubMed
TargetSerine-protein kinase ATM(Homo sapiens (Human))
Vertex Pharmaceuticals
Curated by ChEMBL
LigandPNGBDBM50341750(3-amino-6-(4-(tert-butylsulfonyl)phenyl)-N-phenylp...)
Affinity DataIC50: >8.00E+3nM. Assay description: Inhibition of full length recombinant ATM after 24 hrs by radiometric phosphate incorporation assay
In DepthDetails ArticlePubMed
TargetSerine/threonine-protein kinase ATR(Homo sapiens (Human))
Vertex Pharmaceuticals
Curated by ChEMBL
LigandPNGBDBM50341750(3-amino-6-(4-(tert-butylsulfonyl)phenyl)-N-phenylp...)
Affinity DataIC50:  6nM. Assay description: Inhibition of full length recombinant ATR after 24 hrs by radiometric phosphate incorporation assay
In DepthDetails ArticlePubMed
TargetDNA-dependent protein kinase catalytic subunit(Homo sapiens (Human))
Vertex Pharmaceuticals
Curated by ChEMBL
LigandPNGBDBM50341750(3-amino-6-(4-(tert-butylsulfonyl)phenyl)-N-phenylp...)
Affinity DataIC50: >8.00E+3nM. Assay description: Inhibition of DNAPK after 2 hrs by radiometric phosphate incorporation assay
In DepthDetails ArticlePubMed