BDBM50341835 (S)-2-amino-N-((S)-1-(5-(dimethylamino)pentylamino)-1-oxo-3-phenylpropan-2-yl)-3-(1H-imidazol-4-yl)propanamide::CHEMBL1767019
SMILES CN(C)CCCCCNC(=O)[C@H](Cc1ccccc1)NC(=O)[C@@H](N)Cc1cnc[nH]1
InChI Key InChIKey=INIYKHLTCFVPKO-PMACEKPBSA-N
Data  1 Kd
  Tab Delimited (TSV)   2D SDfile   Computed 3D by Vconf -m prep SDfile
Find this compound or compounds like it in BindingDB:
Activity Spreadsheet -- Enzyme Inhibition Constant Data from BindingDB
Found 1 hit for monomerid = 50341835
TargetIsoform 4 of Lethal(3)malignant brain tumor-like protein 1 (4)(Homo sapiens (Human))
University Of North Carolina At Chapel Hill
Curated by ChEMBL
LigandPNGBDBM50341835((S)-2-amino-N-((S)-1-(5-(dimethylamino)pentylamino...)
Affinity DataKd: >1.00E+5nM. Assay description: Binding affinity to human L3MBTL1 assessed as dissociation constant by isothermal titration calorimetric assay
In DepthDetails ArticlePubMed