BDBM50341918 (2-heptylamino-1-phosphono-ethyl)-phosphonic acid::1-[(n-hept-1-ylamino)ethyl]-1,1-bisphosphonic acid::2-(heptylamino)ethane-1,1-diyldiphosphonic acid::CHEMBL261473
SMILES CCCCCCCNCC(P(O)(O)=O)P(O)(O)=O
InChI Key InChIKey=WRMHTOUCTOHPIY-UHFFFAOYSA-N
Data  7 IC50
PDB links: 1 PDB ID matches this monomer.
  Tab Delimited (TSV)   2D SDfile   Computed 3D by Vconf -m prep SDfile
Find this compound or compounds like it in BindingDB:
Activity Spreadsheet -- Enzyme Inhibition Constant Data from BindingDB
Found 7 hits for monomerid = 50341918
TargetFarnesyl diphosphate synthase(Trypanosoma cruzi)
Universidad De Buenos Aires
Curated by ChEMBL
LigandPNGBDBM50341918((2-heptylamino-1-phosphono-ethyl)-phosphonic acid ...)
Affinity DataIC50:  58nM. Assay description: Inhibition of Trypanosoma cruzi FPPS after 30 mins using [14C]IPP by scintillation counting
TargetFarnesyl diphosphate synthase(Toxoplasma gondii)
Universidad De Buenos Aires
Curated by ChEMBL
LigandPNGBDBM50341918((2-heptylamino-1-phosphono-ethyl)-phosphonic acid ...)
Affinity DataIC50:  95nM. Assay description: Inhibition of Toxoplasma gondii FPPS
In DepthDetails ArticlePubMed
TargetFarnesyl diphosphate synthase(Trypanosoma cruzi)
Universidad De Buenos Aires
Curated by ChEMBL
LigandPNGBDBM50341918((2-heptylamino-1-phosphono-ethyl)-phosphonic acid ...)
Affinity DataIC50:  58nM. Assay description: Inhibition of Trypanosoma cruzi FPPS
TargetFarnesyl diphosphate synthase(Trypanosoma cruzi)
Universidad De Buenos Aires
Curated by ChEMBL
LigandPNGBDBM50341918((2-heptylamino-1-phosphono-ethyl)-phosphonic acid ...)
Affinity DataIC50:  58nM. Assay description: Inhibition of Trypanosoma cruzi FPPS using DMAPP as substrate incubated for 30 mins measured by scintillation counting
TargetFarnesyl diphosphate synthase(Toxoplasma gondii)
Universidad De Buenos Aires
Curated by ChEMBL
LigandPNGBDBM50341918((2-heptylamino-1-phosphono-ethyl)-phosphonic acid ...)
Affinity DataIC50:  95nM. Assay description: Inhibition of Toxoplasma gondii FPPS
In DepthDetails ArticlePubMed
TargetFarnesyl diphosphate synthase(Toxoplasma gondii)
Universidad De Buenos Aires
Curated by ChEMBL
LigandPNGBDBM50341918((2-heptylamino-1-phosphono-ethyl)-phosphonic acid ...)
Affinity DataIC50:  95nM. Assay description: Inhibition of Toxoplasma gondii FPPS using DMAPP as substrate incubated for 30 mins measured by scintillation counting
In DepthDetails ArticlePubMed
TargetSolanesyl diphosphate synthase(Trypanosoma cruzi)
Universidad De Buenos Aires
Curated by ChEMBL
LigandPNGBDBM50341918((2-heptylamino-1-phosphono-ethyl)-phosphonic acid ...)
Affinity DataIC50:  1.69E+3nM. Assay description: Inhibition of Trypanosoma cruzi SPPS
In DepthDetails ArticlePubMed