BDBM50342138 CHEMBL1766014::Methyl 3-(1H-Imidazol-1-yl)-2,3-dimethyl-3-((4-naphthalene-2-yloxy)phenyl)propanoate
SMILES COC(=O)C(C)(C)C(c1ccc(Oc2ccc3ccccc3c2)cc1)n1ccnc1
InChI Key InChIKey=CHHVTDCSQGINRS-UHFFFAOYSA-N
Data  1 IC50
  Tab Delimited (TSV)   2D SDfile   Computed 3D by Vconf -m prep SDfile
Find this compound or compounds like it in BindingDB:
Activity Spreadsheet -- Enzyme Inhibition Constant Data from BindingDB
Found 1 hit for monomerid = 50342138
TargetCytochrome P450 26A1(Homo sapiens (Human))
Cardiff University
Curated by ChEMBL
LigandPNGBDBM50342138(CHEMBL1766014 | Methyl 3-(1H-Imidazol-1-yl)-2,3-di...)
Affinity DataIC50: >1.00E+3nM. Assay description: Inhibition of CYP26A1 in human MCF7 cell microsomes using [3H]ATRA after 1 hr by scintillation counting
In DepthDetails ArticlePubMed