BDBM50342269 (R)-2-((2S,3S)-2-((S)-2-((S)-1-((S)-2-((S)-2-amino-5-guanidinopentanamido)-5-guanidinopentanoyl)pyrrolidine-2-carboxamido)-3-(4-hydroxyphenyl)propanamido)-3-methylpentanamido)-4-methylpentanoic acid::CHEMBL1766934
SMILES [#6]-[#6]-[#6@H](-[#6])-[#6@H](-[#7]-[#6](=O)-[#6@H](-[#6]-c1ccc(-[#8])cc1)-[#7]-[#6](=O)-[#6@@H]-1-[#6]-[#6]-[#6]-[#7]-1-[#6](=O)-[#6@H](-[#6]-[#6]-[#6]\[#7]=[#6](\[#7])-[#7])-[#7]-[#6](=O)-[#6@@H](-[#7])-[#6]-[#6]-[#6]\[#7]=[#6](\[#7])-[#7])-[#6](=O)-[#7]-[#6@H](-[#6]-[#6](-[#6])-[#6])-[#6](-[#8])=O
InChI Key InChIKey=DQDBCHHEIKQPJD-DXIOIEOVSA-N
Data  2 KI
  Tab Delimited (TSV)   2D SDfile   Computed 3D by Vconf -m prep SDfile
Find this compound or compounds like it in BindingDB:
Activity Spreadsheet -- Enzyme Inhibition Constant Data from BindingDB
Found 2 hits for monomerid = 50342269
TargetNeurotensin receptor type 1(Homo sapiens (Human))
Friedrich-Alexander University
Curated by ChEMBL
LigandPNGBDBM50342269((R)-2-((2S,3S)-2-((S)-2-((S)-1-((S)-2-((S)-2-amino...)
Affinity DataKi:  1.30E+3nM. Assay description: Displacement of [3H]neurotensin from human NTS1 receptor expressed in CHO cells
In DepthDetails ArticlePubMed
TargetNeurotensin receptor type 2(Homo sapiens (Human))
Friedrich-Alexander University
Curated by ChEMBL
LigandPNGBDBM50342269((R)-2-((2S,3S)-2-((S)-2-((S)-1-((S)-2-((S)-2-amino...)
Affinity DataKi:  3.70E+3nM. Assay description: Displacement of [3H]NT from human NTS2 receptor expressed in HEK293 cells
In DepthDetails ArticlePubMed