BDBM50342627 CHEMBL1770717::N-((6S,9R)-6-(2,3-difluorophenyl)-3-(1-(trifluoromethyl)cyclopropyl)-6,7,8,9-tetrahydro-5H-imidazo[1,2-a]azepin-9-yl)-2'-oxo-1',2'-dihydrospiro[piperidine-4,3'-pyrrolo[2,3-b]pyridine]-1-carboxamide
SMILES Fc1cccc([C@@H]2CC[C@@H](NC(=O)N3CCC4(CC3)C(=O)Nc3ncccc43)c3ncc(n3C2)C2(CC2)C(F)(F)F)c1F
InChI Key InChIKey=HIOOJZMLSORUQH-DYESRHJHSA-N
Data  1 KI  2 IC50
  Tab Delimited (TSV)   2D SDfile   Computed 3D by Vconf -m prep SDfile
Find this compound or compounds like it in BindingDB:
Activity Spreadsheet -- Enzyme Inhibition Constant Data from BindingDB
Found 3 hits for monomerid = 50342627
TargetCalcitonin gene-related peptide type 1 receptor(Homo sapiens (Human))
Merck Research Laboratories
Curated by ChEMBL
LigandPNGBDBM50342627(CHEMBL1770717 | N-((6S,9R)-6-(2,3-difluorophenyl)-...)
Affinity DataKi:  0.630nM. Assay description: Displacement of [125I]-CGRP from human recombinant CGRP receptor
In DepthDetails ArticlePubMed
TargetCalcitonin gene-related peptide type 1 receptor(Homo sapiens (Human))
Merck Research Laboratories
Curated by ChEMBL
LigandPNGBDBM50342627(CHEMBL1770717 | N-((6S,9R)-6-(2,3-difluorophenyl)-...)
Affinity DataIC50:  8.60nM. Assay description: Antagonist activity at CGRP receptor assessed as inhibition of CGRP-stimulated cAMP production by cell based assay in presence of 50% human serum
In DepthDetails ArticlePubMed
TargetCalcitonin gene-related peptide type 1 receptor(Homo sapiens (Human))
Merck Research Laboratories
Curated by ChEMBL
LigandPNGBDBM50342627(CHEMBL1770717 | N-((6S,9R)-6-(2,3-difluorophenyl)-...)
Affinity DataIC50:  1.40nM. Assay description: Antagonist activity at CGRP receptor assessed as inhibition of CGRP-stimulated cAMP production by cell based assay
In DepthDetails ArticlePubMed