BDBM50342656 CHEMBL1770735::benzo[b]thiophen-2-ylmethanamine
SMILES NCc1cc2ccccc2s1
InChI Key InChIKey=WKYFWFHTABURGB-UHFFFAOYSA-N
Data  1 KI  3 IC50
  Tab Delimited (TSV)   2D SDfile   Computed 3D by Vconf -m prep SDfile
Find this compound or compounds like it in BindingDB:
Activity Spreadsheet -- Enzyme Inhibition Constant Data from BindingDB
Found 4 hits for monomerid = 50342656
TargetCytochrome P450 2A6(Homo sapiens (Human))
University Of Eastern Finland
Curated by ChEMBL
LigandPNGBDBM50342656(CHEMBL1770735 | benzo[b]thiophen-2-ylmethanamine)
Affinity DataKi:  10nM. Assay description: Inhibition of human CYP2A6 in baculovirus-infected insect cell system using coumarin 7 as substrate preincubated for 10 mins by fluorescence assay
In DepthDetails ArticlePubMed
TargetAcid-sensing ion channel 3(Homo sapiens (Human))
Merck Research Laboratories
Curated by ChEMBL
LigandPNGBDBM50342656(CHEMBL1770735 | benzo[b]thiophen-2-ylmethanamine)
Affinity DataIC50:  9.70E+4nM. Assay description: Inhibition of human ASIC3 expressed in HEK293 cells assessed as inhibition of acid-evoked current by manual patch-clamp electrophysiology assay
In DepthDetails ArticlePubMed
TargetCytochrome P450 2A6(Homo sapiens (Human))
University Of Eastern Finland
Curated by ChEMBL
LigandPNGBDBM50342656(CHEMBL1770735 | benzo[b]thiophen-2-ylmethanamine)
Affinity DataIC50:  100nM. Assay description: Inhibition of human CYP2A6 in baculovirus-infected insect cell system using coumarin 7 as substrate preincubated for 10 mins by fluorescence assay
In DepthDetails ArticlePubMed
TargetCytochrome P450 2A6(Homo sapiens (Human))
University Of Eastern Finland
Curated by ChEMBL
LigandPNGBDBM50342656(CHEMBL1770735 | benzo[b]thiophen-2-ylmethanamine)
Affinity DataIC50:  100nM. Assay description: Inhibition of CYP2A6 in human liver microsomes assessed as inhibition of coumarin 7-hydroxylation after 10 mins by plate reader
In DepthDetails ArticlePubMed