BDBM50342658 (4-(1H-imidazol-4-yl)phenyl)methanamine::CHEMBL1770737
SMILES NCc1ccc(cc1)-c1c[nH]cn1
InChI Key InChIKey=HGIDLCJAORUXFC-UHFFFAOYSA-N
Data  1 IC50
  Tab Delimited (TSV)   2D SDfile   Computed 3D by Vconf -m prep SDfile
Find this compound or compounds like it in BindingDB:
Activity Spreadsheet -- Enzyme Inhibition Constant Data from BindingDB
Found 1 hit for monomerid = 50342658
TargetAcid-sensing ion channel 3(Homo sapiens (Human))
Merck Research Laboratories
Curated by ChEMBL
LigandPNGBDBM50342658((4-(1H-imidazol-4-yl)phenyl)methanamine | CHEMBL17...)
Affinity DataIC50:  1.60E+5nM. Assay description: Inhibition of human ASIC3 expressed in HEK293 cells assessed as inhibition of acid-evoked current by manual patch-clamp electrophysiology assay
In DepthDetails ArticlePubMed