BDBM50342701 2-(4-((1R,2S)-2-(2-(5-(1H-1,2,3-triazol-1-yl)pyridin-2-yloxy)ethyl)cyclopropyl)piperidin-1-yl)-5-chloropyrimidine::CHEMBL1771102
SMILES Clc1cnc(nc1)N1CCC(CC1)[C@H]1C[C@H]1CCOc1ccc(cn1)-n1ccnn1
InChI Key InChIKey=SPYYSSJCCWKFGM-VQIMIIECSA-N
Data  1 IC50  2 EC50
  Tab Delimited (TSV)   2D SDfile   Computed 3D by Vconf -m prep SDfile
Find this compound or compounds like it in BindingDB:
Activity Spreadsheet -- Enzyme Inhibition Constant Data from BindingDB
Found 3 hits for monomerid = 50342701
TargetGlucose-dependent insulinotropic receptor(Homo sapiens (Human))
Merck
Curated by ChEMBL
LigandPNGBDBM50342701(2-(4-((1R,2S)-2-(2-(5-(1H-1,2,3-triazol-1-yl)pyrid...)
Affinity DataEC50:  2nM. Assay description: Agonist activity at human GPR119 expressed in CHO cells co-expressing Galpha15 assessed as increase of intracellular cAMP accumulation after 60 mins ...
In DepthDetails ArticlePubMed
TargetPotassium voltage-gated channel subfamily H member 2(Homo sapiens (Human))
Merck
Curated by ChEMBL
LigandPNGBDBM50342701(2-(4-((1R,2S)-2-(2-(5-(1H-1,2,3-triazol-1-yl)pyrid...)
Affinity DataIC50:  4.40E+4nM. Assay description: Inhibition of human ERG by patch clamp technique
In DepthDetails ArticlePubMed
TargetGlucose-dependent insulinotropic receptor(Mus musculus)
Merck
Curated by ChEMBL
LigandPNGBDBM50342701(2-(4-((1R,2S)-2-(2-(5-(1H-1,2,3-triazol-1-yl)pyrid...)
Affinity DataEC50:  4nM. Assay description: Agonist activity at mouse GPR119 expressed in CHO cells co-expressing Galpha15 assessed as increase of intracellular cAMP accumulation after 60 mins ...
In DepthDetails ArticlePubMed