BDBM50342717 4'-Acetyl-biphenyl-4-carboxylic acid {4-[4-(2-methoxy-phenyl)-piperazin-1-yl]-butyl}-amide::4'-acetyl-N-(4-(4-(2-methoxyphenyl)piperazin-1-yl)butyl)biphenyl-4-carboxamide::CHEMBL294747
SMILES COc1ccccc1N1CCN(CCCCNC(=O)c2ccc(cc2)-c2ccc(cc2)C(C)=O)CC1
InChI Key InChIKey=JARNORYOPMINDY-UHFFFAOYSA-N
Data  10 KI
  Tab Delimited (TSV)   2D SDfile   Computed 3D by Vconf -m prep SDfile
Find this compound or compounds like it in BindingDB:
Activity Spreadsheet -- Enzyme Inhibition Constant Data from BindingDB
Found 10 hits for monomerid = 50342717
TargetD(3) dopamine receptor(Homo sapiens (Human))TBA
LigandPNGBDBM50342717(4'-Acetyl-biphenyl-4-carboxylic acid {4-[4-(2-meth...)
Affinity DataKi:  0.316nM. Assay description: Binding affinity towards Chinese hamster ovary cells transfected with human D3 receptor using [3H]spiperone
In DepthDetails
TargetD(3) dopamine receptor(Homo sapiens (Human))TBA
LigandPNGBDBM50342717(4'-Acetyl-biphenyl-4-carboxylic acid {4-[4-(2-meth...)
Affinity DataKi:  0.320nM. Assay description: Displacement of [125I]iodosulpiride from human Dopamine receptor D3 expressed in CHO cellsChecked by Author
In DepthDetails Article
TargetD(3) dopamine receptor(Homo sapiens (Human))TBA
LigandPNGBDBM50342717(4'-Acetyl-biphenyl-4-carboxylic acid {4-[4-(2-meth...)
Affinity DataKi:  0.320nM. Assay description: Binding affinity to dopamine D3 receptor
In DepthDetails ArticlePubMed
Target5-hydroxytryptamine receptor 1A(Mus musculus (Mouse))TBA
LigandPNGBDBM50342717(4'-Acetyl-biphenyl-4-carboxylic acid {4-[4-(2-meth...)
Affinity DataKi:  3.20nM. Assay description: Ability to displace [125I]iodosulpiride from 5-hydroxytryptamine 1A receptorChecked by Author
In DepthDetails Article
Target5-hydroxytryptamine receptor 1A(Rattus norvegicus (rat))TBA
LigandPNGBDBM50342717(4'-Acetyl-biphenyl-4-carboxylic acid {4-[4-(2-meth...)
Affinity DataKi:  3.20nM. Assay description: Binding affinity towards 5-hydroxytryptamine 1A receptor using [3H]8-OH-DPAT in rat hippocampus
In DepthDetails
TargetAlpha-1A/Alpha-1B/Alpha-1D adrenergic receptor(Rattus norvegicus (rat))TBA
LigandPNGBDBM50342717(4'-Acetyl-biphenyl-4-carboxylic acid {4-[4-(2-meth...)
Affinity DataKi:  13nM. Assay description: Binding affinity towards Alpha-1 adrenergic receptor using [3H]prazosin in rat heart
In DepthDetails
TargetD(2) dopamine receptor(Homo sapiens (Human))TBA
LigandPNGBDBM50342717(4'-Acetyl-biphenyl-4-carboxylic acid {4-[4-(2-meth...)
Affinity DataKi:  40nM. Assay description: Displacement of [125I]iodosulpiride from human Dopamine receptor D2 expressed in CHO cellsChecked by Author
In DepthDetails Article
TargetD(2) dopamine receptor(Homo sapiens (Human))TBA
LigandPNGBDBM50342717(4'-Acetyl-biphenyl-4-carboxylic acid {4-[4-(2-meth...)
Affinity DataKi:  40nM. Assay description: Binding affinity towards mouse LtK- cells transfected with human D2 receptor using [3H]spiperone
In DepthDetails
TargetD(4) dopamine receptor(Homo sapiens (Human))TBA
LigandPNGBDBM50342717(4'-Acetyl-biphenyl-4-carboxylic acid {4-[4-(2-meth...)
Affinity DataKi:  63nM. Assay description: Binding affinity towards Dopamine D4 receptor
In DepthDetails
LigandPNGBDBM50342717(4'-Acetyl-biphenyl-4-carboxylic acid {4-[4-(2-meth...)
Affinity DataKi:  398nM. Assay description: Binding affinity towards D1 receptor using [3H]-SCH- 23390 in rat striatal tissue
In DepthDetails