BDBM50342802 5-Methyl-2-(3,4,5-trichlorophenyl)isoindoline-1,3-dione::CHEMBL1770588
SMILES Cc1ccc2C(=O)N(C(=O)c2c1)c1cc(Cl)c(Cl)c(Cl)c1
InChI Key InChIKey=UAQIZUOPEZZQCR-UHFFFAOYSA-N
Data  2 IC50
  Tab Delimited (TSV)   2D SDfile   Computed 3D by Vconf -m prep SDfile
Find this compound or compounds like it in BindingDB:
Activity Spreadsheet -- Enzyme Inhibition Constant Data from BindingDB
Found 2 hits for monomerid = 50342802
TargetProstaglandin G/H synthase 2(Ovis aries (Sheep))
King Saud University
Curated by ChEMBL
LigandPNGBDBM50342802(5-Methyl-2-(3,4,5-trichlorophenyl)isoindoline-1,3-...)
Affinity DataIC50:  1.95E+4nM. Assay description: Inhibition of ovine COX2 after 5 mins by enzyme immunoassay
In DepthDetails ArticlePubMed
TargetProstaglandin G/H synthase 1(Ovis aries (Sheep))
King Saud University
Curated by ChEMBL
LigandPNGBDBM50342802(5-Methyl-2-(3,4,5-trichlorophenyl)isoindoline-1,3-...)
Affinity DataIC50: >1.00E+5nM. Assay description: Inhibition of ovine COX1 after 5 mins by enzyme immunoassay
In DepthDetails ArticlePubMed