BDBM50342808 4,5,6,7-Tetrachloro-2-(3,4,5-trichlorophenyl)isoindoline-1,3-dione::CHEMBL1770594
SMILES Clc1cc(cc(Cl)c1Cl)N1C(=O)c2c(C1=O)c(Cl)c(Cl)c(Cl)c2Cl
InChI Key InChIKey=DQYUYLGCWJEMPF-UHFFFAOYSA-N
Data  2 IC50
  Tab Delimited (TSV)   2D SDfile   Computed 3D by Vconf -m prep SDfile
Find this compound or compounds like it in BindingDB:
Activity Spreadsheet -- Enzyme Inhibition Constant Data from BindingDB
Found 2 hits for monomerid = 50342808
TargetProstaglandin G/H synthase 2(Ovis aries (Sheep))
King Saud University
Curated by ChEMBL
LigandPNGBDBM50342808(4,5,6,7-Tetrachloro-2-(3,4,5-trichlorophenyl)isoin...)
Affinity DataIC50:  4.50E+4nM. Assay description: Inhibition of ovine COX2 after 5 mins by enzyme immunoassay
In DepthDetails ArticlePubMed
TargetProstaglandin G/H synthase 1(Ovis aries (Sheep))
King Saud University
Curated by ChEMBL
LigandPNGBDBM50342808(4,5,6,7-Tetrachloro-2-(3,4,5-trichlorophenyl)isoin...)
Affinity DataIC50: >1.00E+5nM. Assay description: Inhibition of ovine COX1 after 5 mins by enzyme immunoassay
In DepthDetails ArticlePubMed