BDBM50343006 (R)-N2-isopropyl-N2-methyl-6-(3-(methylamino)pyrrolidin-1-yl)pyrimidine-2,4-diamine::CHEMBL1770991
SMILES CN[C@@H]1CCN(C1)c1cc(N)nc(n1)N(C)C(C)C
InChI Key InChIKey=VOKNXLPPDJDMCQ-SNVBAGLBSA-N
Data  1 KI
  Tab Delimited (TSV)   2D SDfile   Computed 3D by Vconf -m prep SDfile
Find this compound or compounds like it in BindingDB:
Activity Spreadsheet -- Enzyme Inhibition Constant Data from BindingDB
Found 1 hit for monomerid = 50343006
TargetHistamine H4 receptor(Homo sapiens (Human))
Johnson & Johnson Pharmaceutical Research & Development
Curated by ChEMBL
LigandPNGBDBM50343006((R)-N2-isopropyl-N2-methyl-6-(3-(methylamino)pyrro...)
Affinity DataKi:  140nM. Assay description: Displacement of [3H]histamine from human histamine H4 receptor
In DepthDetails ArticlePubMed