BDBM50343026 CHEMBL1771206::rac-(Butyramido(naphthalen-1-yl)methyl)phosphonic acid
SMILES CCCC(=O)NC(c1cccc2ccccc12)P(O)(O)=O
InChI Key InChIKey=QCRUDAFAXCRCPE-UHFFFAOYSA-N
Data  2 KI
  Tab Delimited (TSV)   2D SDfile   Computed 3D by Vconf -m prep SDfile
Find this compound or compounds like it in BindingDB:
Activity Spreadsheet -- Enzyme Inhibition Constant Data from BindingDB
Found 2 hits for monomerid = 50343026
TargetFe(3+)-Zn(2+) purple acid phosphatase(Phaseolus vulgaris)
The University Of Queensland
Curated by ChEMBL
LigandPNGBDBM50343026(CHEMBL1771206 | rac-(Butyramido(naphthalen-1-yl)me...)
Affinity DataKi:  2.38E+5nMpH: 4.9Assay Description:Competitive inhibition of red kidney bean PAP using para-nitrophenol as substrate at pH 4.9 preincubated for 10 mins by UV-visible spectrophotometry
In DepthDetails ArticlePubMed
TargetFe(3+)-Zn(2+) purple acid phosphatase(Phaseolus vulgaris)
The University Of Queensland
Curated by ChEMBL
LigandPNGBDBM50343026(CHEMBL1771206 | rac-(Butyramido(naphthalen-1-yl)me...)
Affinity DataKi:  6.54E+5nMpH: 4.9Assay Description:Uncompetitive inhibition of red kidney bean PAP using para-nitrophenol as substrate at pH 4.9 preincubated for 10 mins by UV-visible spectrophotometr...
In DepthDetails ArticlePubMed