BDBM50343076 (S)-2-(3,4-dimethoxybenzylidene)-N-(4-(4-methoxyphenethylamino)-3,4-dioxo-1-phenylbutan-2-yl)hexanamide::CHEMBL1771027
SMILES CCCCC(=Cc1ccc(OC)c(OC)c1)C(=O)N[C@@H](Cc1ccccc1)C(=O)C(=O)NCCc1ccc(OC)cc1
InChI Key InChIKey=ZVZSRXVKWZRLLU-LJAQVGFWSA-N
Data  1 IC50
  Tab Delimited (TSV)   2D SDfile   Computed 3D by Vconf -m prep SDfile
Find this compound or compounds like it in BindingDB:
Activity Spreadsheet -- Enzyme Inhibition Constant Data from BindingDB
Found 1 hit for monomerid = 50343076
TargetCalpain-1 catalytic subunit(Homo sapiens (Human))
College Of Pharmacy Kyung Hee University
Curated by ChEMBL
LigandPNGBDBM50343076((S)-2-(3,4-dimethoxybenzylidene)-N-(4-(4-methoxyph...)
Affinity DataIC50:  1.38E+3nM. Assay description: Inhibition of human erythrocytes mu-calpain using Suc-Leu-Tyr-AMC fluorogenic substrate after 30 mins by spectrofluorimetery
In DepthDetails ArticlePubMed