BDBM50343349 2-Cyclohexyl-1-[4-(3-thiophen-2-yl-[1,2,4]oxadiazol-5-yl)-piperidin-1-yl]-ethanone::CHEMBL1773962
SMILES O=C(CC1CCCCC1)N1CCC(CC1)c1nc(no1)-c1cccs1
InChI Key InChIKey=CTZIYDCKRRFLFJ-UHFFFAOYSA-N
Data  1 IC50
  Tab Delimited (TSV)   2D SDfile   Computed 3D by Vconf -m prep SDfile
Find this compound or compounds like it in BindingDB:
Activity Spreadsheet -- Enzyme Inhibition Constant Data from BindingDB
Found 1 hit for monomerid = 50343349
TargetHTH-type transcriptional regulator EthR(Mycobacterium tuberculosis)
University Of Lille
Curated by ChEMBL
LigandPNGBDBM50343349(2-Cyclohexyl-1-[4-(3-thiophen-2-yl-[1,2,4]oxadiazo...)
Affinity DataIC50:  3.50E+3nM. Assay description: Inhibition of Mycobacterium tuberculosis EthR interaction to ethA promoter after 5 mins by surface plasmon resonance assay
In DepthDetails ArticlePubMed