BDBM50343405 6-(9-chloro-4-(4-fluorophenyl)-5H-chromeno[4,3-b]pyridin-2-yl)-3,4-dihydro-2H-benzo[b][1,4]oxazin-3-ol::CHEMBL1774938
SMILES OC1COc2ccc(cc2N1)-c1cc(-c2ccc(F)cc2)c2COc3ccc(Cl)cc3-c2n1
InChI Key InChIKey=NVLFLIGMWAYTNM-UHFFFAOYSA-N
Data  1 IC50
  Tab Delimited (TSV)   2D SDfile   Computed 3D by Vconf -m prep SDfile
Find this compound or compounds like it in BindingDB:
Activity Spreadsheet -- Enzyme Inhibition Constant Data from BindingDB
Found 1 hit for monomerid = 50343405
TargetUracil-DNA glycosylase(Vaccinia virus (strain Western Reserve) (VACV) (Va...)
University Of Pennsylvania
Curated by ChEMBL
LigandPNGBDBM50343405(6-(9-chloro-4-(4-fluorophenyl)-5H-chromeno[4,3-b]p...)
Affinity DataIC50: >2.00E+5nM. Assay description: Inhibition of Vaccinia virus WR strain processivity factor D4 interaction with A20 protein assessed as inhibition of E9 DNA polymerase-mediated DIG-d...
In DepthDetails ArticlePubMed